Script error fix jobs

Filter

My recent searches
Filter by:
Budget
to
to
to
Type
Skills
Languages
    Job State
    3,093 script error fix jobs found, pricing in GBP

    I need to fix a php script error on a registry site @ [login to view URL] I get the error Parse error: syntax error, unexpected '(', expecting T_STRING or T_VARIABLE or '{' or '$' in /home/guiaa346/public_html/[login to view URL] on line 45

    £18 (Avg Bid)
    £18 Avg Bid
    29 bids

    Currently getting an error on a PHP script I had developed years ago. Looking for someone to resolve the issue. Shouldn't take more than 10-20 minutes to fix. Only looking for someone in the UK/US/CA or Australia to fix this.

    £18 (Avg Bid)
    £18 Avg Bid
    31 bids

    Hi I have a web script and 2 apps driver and customer. It's a ride sharing apps. I have install it my server. but not run properly. Have anyone to fix this problem. this web script is written by codeignator and apps are written in android studio.

    £21 (Avg Bid)
    £21 Avg Bid
    4 bids

    I need you to develop some software for me. I would like this software to be developed for Windows using Python.

    £20 (Avg Bid)
    £20 Avg Bid
    14 bids

    Hi Celal, you did a google script project(s) for me a few months ago and one of the scripts has an error. I was wondering if you could do a quick fix? https://docs.google.com/spreadsheets/d/1CeSVzG1q31sVueaFGKioZMQbErQuACRwFWNZ4_UkpQo/edit#gid=1060002559

    £27 / hr (Avg Bid)
    £27 / hr Avg Bid
    1 bids

    Running a test project and trying to connect to RESTFul API with my Python script Running on Ubuntu Server Running on VMWare on my Win10 PC. The Error of CERITIFICATE_VERIFY_FAILED is shown (_ssl.c:847). I installed cerifi package, but have no idea how to activate it and fix a problem. I can access the API with the web browser though. Python 3.6. Remote

    £34 (Avg Bid)
    £34 Avg Bid
    5 bids

    Hi i have a python script that posts movies to wordpress theme and there is 2 options on the script. I can choose to update a existing movie link or i can choose not to update the links. The issue now is that, i want to update existing video urls but it's not working. So i need you to fix this for me asap. It's urgent

    £16 (Avg Bid)
    £16 Avg Bid
    15 bids

    I have a file sharing script called Droppy, and it's not allowing uploads of large files. I need someone to fix it so it can do it's job effectively.

    £16 (Avg Bid)
    £16 Avg Bid
    35 bids

    ... wget --user "<domainusername>" --password "<password>" <webservice_url> ii) FAIL: If I run the PHP script using CURL as mentioned in the tutorials I always get PHP errors like Fatal error: Uncaught SoapFault exception: [WSDL] SOAP-ERROR: Parsing WSDL: Couldn't load from '<webservice_url>' : failed to load ex...

    £13 / hr (Avg Bid)
    £13 / hr Avg Bid
    9 bids

    ...team to fix the 49 errors together and integrate the App onto a working server within the 5 days through Team Viewer and Skype through CEO Must have advance skills 10+yrs Must speak complete English. Command /Users/newowner/Desktop/[login to view URL] failed with exit code 1 Ditto Error Group

    £111 (Avg Bid)
    £111 Avg Bid
    6 bids

    ...connecting correctly from the ecommerce site. site error log complains of no mysqli connection. I have tested as much as I can and I need a quality unix admin to assist me. Current version of php is 7.2.4 Maria db 5.5.6 I cant find whats wrong. mariadb log shows no issues. httpd log is inconclusive. A manual script from the site root, runs and shows a connection

    £118 (Avg Bid)
    £118 Avg Bid
    8 bids

    Hey, I am looking for someone to fix an Error in Inno Script.

    £19 (Avg Bid)
    £19 Avg Bid
    6 bids

    I have a parse error such as Description: An error occurred during the parsing of a resource required to service this request. Please review the following specific parse error details and modify your source file appropriately. Parser Error Message: Could not load type '[login to view URL]'. I would like these fixed

    £18 (Avg Bid)
    £18 Avg Bid
    16 bids

    We need instant server fix for critical error happened today. "Failed to start LSB: OpenIPMI Driver init script" "Failed to start LSB: Systems management Data Engine" see attached

    £12 / hr (Avg Bid)
    £12 / hr Avg Bid
    18 bids

    Hello, I have the oxyclassifieds script with 2 errors to fix: 1- database query error 2- Change the home page to display the last 20 ads listings Regards, Aissa

    £18 (Avg Bid)
    £18 Avg Bid
    15 bids

    Hi I have a python script that run up to 100 tasks in parallel but running a lot of tasks i get the following error Got exception HTTPSConnectionPool(host='XXXXXXXXXXX', port=443): Max retr ies exceeded with url: /auth/sign_in (Caused by NewConnectionError('<[login to view URL] [login to view URL] object at 0x06859210>: Failed to establish a

    £21 (Avg Bid)
    £21 Avg Bid
    8 bids

    I have and Adult Website running on an Adultwatch script, it is hosted on GoDaddy.. Need a webmaster to fix a few things, keep getting errors and they fill the error log and crash the site. I can't get into WHM or Cpanel. Need the errors disabled so they don't log or fix the error.. I had it disabled but when they patched the server it set it back to

    £29 / hr (Avg Bid)
    Local
    £29 / hr Avg Bid
    9 bids

    Project is to fix an error in a WordPress site. The error appears to be in a PHP file. The error is very generic and [login to view URL] on some page loads, not others, and when it does, if you refresh a few times, page may [login to view URL], some pages just will not load at all however may times you refresh. The site in question has been running 5 years

    £90 (Avg Bid)
    £90 Avg Bid
    45 bids

    I'm upgrading my forum from VBulletin 4.2.5 with DBSEO ...Vbulletin 5 for the same page. On top of that, I want to have a small script that detect any 404 and notify me the URl requested in order to be able to fix any missing redirect. Together with the developer we will choose if put this script in a 404 page of Vbulletin or to the 404 error handler.

    £67 (Avg Bid)
    £67 Avg Bid
    6 bids

    ...the white screen of death, after turning on the debugging i get these errors but i have no idea on how to fix them, if you think you can help me please offer me your price here, i would appreciate it if you tell me what's going on and how to fix it if it happens again, thanks! Warning: include(/home/content/n3pnexwpnas04_data02/98/41855098/html/wp-

    £21 (Avg Bid)
    £21 Avg Bid
    18 bids

    This is a 2 minutes fix if you know what you are doing. I believe HTTP Error 405 come from some HTML Script Coding within website. I am not sure what causing it. Easy fix.

    £5 / hr (Avg Bid)
    £5 / hr Avg Bid
    26 bids

    Debug and fix ajax/jquery error, it gives parse error instead of reloading page. The script works OK data is saved, but instead good finalization gives parse error popup.

    £15 (Avg Bid)
    £15 Avg Bid
    9 bids

    ...module tier sur magento Check Cron Scripts Cron script readiness check failed. Hide detail Error from Setup Application Cron Script: Cron job has not been configured yet Other checks will fail as a result (PHP version, PHP settings, and PHP extensions) Error from Updater Application Cron Script: Cron job has not been configured yet For additional

    £148 (Avg Bid)
    £148 Avg Bid
    37 bids

    ...I have an issue with my wordpress site and cannot find the problem so am looking for a quality wordpress guru to fix it for me. I am running latest WP version , a theme that runs visual composer (not wp bakery version). I have a php script I did to run on a post page (under the tools section of the site). It works fine when I run it in a PAGE, but when

    £25 (Avg Bid)
    £25 Avg Bid
    26 bids

    I would like an expert web developer to fix some of the Mobile Usability and AMP error that my website is experiencing. Specially: The tag 'amp-video extension .js script' is missing or incorrect, but required by 'amp-video'. This will soon be an error. but not limited to this issue. Currently Google Search Console is showing 22 AMP errors and 3

    £25 / hr (Avg Bid)
    £25 / hr Avg Bid
    25 bids

    ...have some problems on actual devices (error when posting data via ajax to a PERL-Script). Furthermore I would like to assess sensor data from the smartphone and include it in the ajax-posts, which I was not able to implement by now. The tasks for the job are: - Fix the ajax-posting problem (illegal invocation error) - Implement the sensordata-assessment

    £353 (Avg Bid)
    £353 Avg Bid
    6 bids

    Hi, I have a landing page here: [login to view URL] It uses a script to call the MailChimp API to do 3 things: 1) add the subscriber to the list 2) set the "form source" custom field to value "Landing Page" 3) add the subscriber to Interest group "10 Steps to Lucid Dreams" This was working fine for over

    £44 (Avg Bid)
    £44 Avg Bid
    5 bids

    ...in. You highlight over the file and a 'red-line' appears. That is pretty ugly. 2) An uploaded file inside the Drop-zone is a bit too big. I couldn't figure out how to fix that. I'm not uploading images. We are uploading cad-files. Here's an example that's cleaner: [login to view URL] But I don't need the size information

    £115 (Avg Bid)
    Urgent Guaranteed
    £115
    13 entries

    Fix and finish my curl script, It must to do next steps, but i'm stuck in step 3, and it needs to be finished too. 1: Go to [login to view URL] 2. Enter credentials: user:gcamacho pass:test [login to view URL] DAL050601L35 (companyId=521) 4. Go to [login to view URL] 5. Filter files by 'Estado'=Error

    £21 (Avg Bid)
    £21 Avg Bid
    6 bids

    Fix my script with curl that follows this steps. 1: Go to [login to view URL] 2. Enter credentials: user:gcamacho pass:test [login to view URL] DAL050601L35 (companyId=521) 4. Go to [login to view URL] 5. Filter files by 'Estado'=Error, in search box 6. Download files under 'Descargar' link in first

    £31 (Avg Bid)
    £31 Avg Bid
    8 bids

    Please test out this script against the datafile small one; run by: $ python3 [login to view URL] [login to view URL] Two Tasks must be completed 1) Please make the function called mydecrypt run in a separate file 2) There is currently an error message; please help me fix it $ python3 [login to view URL] [login to view URL] Traceback (most recent call last): File &...

    £40 (Avg Bid)
    £40 Avg Bid
    3 bids

    hi need to fix a matrimonial script and made it error free for wordpress

    £15 (Avg Bid)
    £15 Avg Bid
    7 bids

    I have a working python script that generates RSS feeds in xml format from different sites. (E.g. blogspot sites, wordpress sites, etc.) TL;DR I need 4 things: 1.) solve "time out" error for selenium plugin 2.) edit script so one version can work without selenium if unnecessary 3.) edit script so no ads are scraped 4.) record/screen cap so I can edit

    £17 (Avg Bid)
    £17 Avg Bid
    9 bids

    I need to fix this script Sub URLPictureInsert() 'Updateby Extendoffice 20161116 Dim Pshp As Shape Dim xRg As Range Dim xCol As Long On Error Resume Next [login to view URL] = False Set Rng = [login to view URL]("Please select the url cells:", "KuTools for excel", [login to view URL], , , , , 8) For Each cell In Rng

    £31 (Avg Bid)
    £31 Avg Bid
    5 bids

    Fix .htaccess / blank page php script Just moved lamp comp. website based on phpmysql to new server. Getting blank page 404 error message need someone to fix this now. Debug, and come up with solution. Currently [login to view URL] is loaded. Symbolic link on private_html to public_html to support ssl

    £18 (Avg Bid)
    £18 Avg Bid
    31 bids

    Hi, a python script was created for me a year ago. This python script did the following: automatic upload of files that are located in one folder to a website portal. For instance, I have a file called "[login to view URL]" on the drive W:Portal Input If I double click the portal python script it runs and louds it up to my client portal website

    £34 / hr (Avg Bid)
    £34 / hr Avg Bid
    21 bids

    ...install it that I click to Readiness Check I got the following error, I contacted my hosting provider but they just could upgrade the PHP version and I'm still having the same problem. Check Cron Scripts Cron script readiness check failed. Hide detail Error from Setup Application Cron Script: Cron job has not been configured yet Other checks will fail

    £33 (Avg Bid)
    £33 Avg Bid
    21 bids

    Hi there we are facing issue in checkout (Magento 2). Error is occurred we think it's from java script. We need someone to fix.

    £43 / hr (Avg Bid)
    £43 / hr Avg Bid
    70 bids

    ...HAS KNOWLEDGE ABOUT QTP TESTING USING MICROSOFT UFT AND SOME KNOWLEDGE ON VBSCRPITING(BASIC MAY WORK) WHAT YOU HAVE TO: I AM WRITING A TEST SCRIPT WHERE I FACE A PROBLEM. ALL YOU HAVE TO DO TO FIX THE SIMPLE ERROR WHICH I WILL DISCUS WITH YOU LATER. ITS NOT A BIG AND COMPLEX JOB. RIGHT PEOPLE CAN DO IT WITHIN A MINUETS. THANK YOU We can discuss any details

    £12 / hr (Avg Bid)
    £12 / hr Avg Bid
    1 bids

    I NEED SOME ONE WHO HAS KNOWLEDGE ABOUT QTP TESTING USING MICROSOFT UFT. WHAT YOU HAVE TO: I AM WRITING A TEST SCRIPT WHERE I FACE A PROBLEM. ALL YOU HAVE TO DO TO FIX THE SIMPLE ERROR WHICH I WILL DISCUS WITH YOU LATER. ITS NOT A BIG AND COMPLEX JOB. RIGHT PEOPLE CAN DO IT WITHIN A MINUETS. THANK YOU

    £22 (Avg Bid)
    £22 Avg Bid
    8 bids

    Hi, we have installed CWP on our server and when we add new subdomain on ,it gets error 500 and php script does not work on that . Please bid if you really can do fix the problem .

    £18 (Avg Bid)
    £18 Avg Bid
    14 bids

    Hello, I have an python script I already added proxies in script, but I think it not working. because when i run the scrapper it give me error "max retry with this url ...." after some time. so i need to fix the problem asap. waiting for your bids.

    £20 (Avg Bid)
    £20 Avg Bid
    5 bids

    Hell...[login to view URL] and there is an error occuring on the Google Login script. The error is "You don't have permission to access /publishers/[login to view URL] on this server. Additionally, a 403 Forbidden error was encountered while trying to use an ErrorDocument to handle the request." I need someone that can fix it as soon as possible....

    £18 (Avg Bid)
    £18 Avg Bid
    19 bids

    HI guys I need someone who knows what they doing with SiberianCMS website generates source code just fine but when I want to generate APK I get this error ERROR: JAVA_HOME is not set and no 'java' command could be found in your PATH. Please set the JAVA_HOME variable in your environment to match the location of your Java installation. There is no

    £144 (Avg Bid)
    £144 Avg Bid
    4 bids

    HI guys I need someone who knows what they doing with SiberianCMS website generates source code just fine but when I want to generate APK I get this error ERROR: JAVA_HOME is not set and no 'java' command could be found in your PATH. Please set the JAVA_HOME variable in your environment to match the location of your Java installation. There is no

    £170 (Avg Bid)
    £170 Avg Bid
    1 bids

    Hi I need dev to help fix few bugs for siberianCMS first of all 1. APK GENERATOR needs fixing as each time when clicking generate apk I get email telling me it's failed Log Files say this Error ERROR: JAVA_HOME is not set and no 'java' command could be found in your PATH. Please set the JAVA_HOME variable in your environment to match the location

    £15 (Avg Bid)
    £15 Avg Bid
    1 bids

    I faced error when I run node script on my server. I need node expert who can fix it in a minute. Thank you.

    £20 (Avg Bid)
    £20 Avg Bid
    11 bids

    I have written a tool that allows me to register accounts on a website. I have compiled a script that will allow me to specify the account to create and a proxy to use. When I am not using proxies, the program runs fine. When I am using proxies, I encounter a problem at the end of the registration. I have to click an accept button, however when I

    £15 (Avg Bid)
    £15 Avg Bid
    4 bids

    I have a computer vision script in Python that analyze images from network cameras. After a few hours running, the script starts outputting the following error: error while decoding MB 0 14, bytestream (4035) [h264 @ 0x458bd60] non-existing SPS 2 referenced in buffering period [h264 @ 0x47b7300] non-existing SPS 2 referenced in buffering period [h264

    £15 (Avg Bid)
    £15 Avg Bid
    4 bids

    Hi i need to fix a feature of a my python script , i think it have a problem easily fixable here is the error : File "/Library/Frameworks/[login to view URL]", line 164, in get [login to view URL]() File "/Library/Frameworks/[login to view URL]", line 295, in wait [login to view URL]()

    £15 (Avg Bid)
    £15 Avg Bid
    16 bids